Reaction Details
TargetSubstance-P receptor
LigandBDBM50106365
Substrate/Competitorn/a
Meas. Tech.ChEMBL_1506611 (CHEMBL3598468)
IC50 0.290000±n/a nM
Citation Degnan, APTora, GOHan, YRajamani, RBertekap, RKrause, RDavis, CDHu, JMorgan, DTaylor, SJKrause, KLi, YWMattson, GCunningham, MATaber, MTLodge, NJBronson, JJGillman, KWMacor, JE Biaryls as potent, tunable dual neurokinin 1 receptor antagonists and serotonin transporter inhibitors. Bioorg Med Chem Lett25:3039-43 (2015) 
 
Substance-P receptor
Name:Substance-P receptor
Type:G Protein-Coupled Receptor (GPCR)
Mol. Mass.:46371.54
Organism:Rattus norvegicus (rat)
Description:Competition binding assays were carried out using membrane preparations from transfected CHO cells that constitutively expressed the rat NK1 receptor.
Residue:407
BDBM50106365
NameBDBM50106365
Synonyms:CHEMBL3596492
TypeSmall organic molecule
Emp. Form.C28H27F3N2O
Mol. Mass.464.522
SMILESCN1CCC(COCc2cc(cc(c2)C(F)(F)F)-c2ccc(cc2)C#N)(CC1)c1ccccc1