Reaction Details
TargetSubstance-P receptor
LigandBDBM50108637
Substrate/Competitorn/a
Meas. Tech.ChEMBL_1506611 (CHEMBL3598468)
IC50 1.6±n/a nM
Citation Degnan, APTora, GOHan, YRajamani, RBertekap, RKrause, RDavis, CDHu, JMorgan, DTaylor, SJKrause, KLi, YWMattson, GCunningham, MATaber, MTLodge, NJBronson, JJGillman, KWMacor, JE Biaryls as potent, tunable dual neurokinin 1 receptor antagonists and serotonin transporter inhibitors. Bioorg Med Chem Lett25:3039-43 (2015) 
 
Substance-P receptor
Name:Substance-P receptor
Type:G Protein-Coupled Receptor (GPCR)
Mol. Mass.:46371.54
Organism:Rattus norvegicus (rat)
Description:Competition binding assays were carried out using membrane preparations from transfected CHO cells that constitutively expressed the rat NK1 receptor.
Residue:407
BDBM50108637
NameBDBM50108637
Synonyms:CHEMBL3596456
TypeSmall organic molecule
Emp. Form.C25H25F3N2O
Mol. Mass.426.474
SMILESFC(F)(F)c1cc(COCC2(CCNCC2)c2ccccc2)cc(c1)-c1ccncc1