Reaction Details
TargetSubstance-P receptor
LigandBDBM50108628
Substrate/Competitorn/a
Meas. Tech.ChEMBL_1506611 (CHEMBL3598468)
IC50 3.4±n/a nM
Citation Degnan, APTora, GOHan, YRajamani, RBertekap, RKrause, RDavis, CDHu, JMorgan, DTaylor, SJKrause, KLi, YWMattson, GCunningham, MATaber, MTLodge, NJBronson, JJGillman, KWMacor, JE Biaryls as potent, tunable dual neurokinin 1 receptor antagonists and serotonin transporter inhibitors. Bioorg Med Chem Lett25:3039-43 (2015) 
 
Substance-P receptor
Name:Substance-P receptor
Type:G Protein-Coupled Receptor (GPCR)
Mol. Mass.:46371.54
Organism:Rattus norvegicus (rat)
Description:Competition binding assays were carried out using membrane preparations from transfected CHO cells that constitutively expressed the rat NK1 receptor.
Residue:407
BDBM50108628
NameBDBM50108628
Synonyms:CHEMBL3596480
TypeSmall organic molecule
Emp. Form.C28H30F3NO2
Mol. Mass.469.5385
SMILESCCOc1ccc(cc1)-c1cc(COCC2(CCNCC2)c2ccccc2)cc(c1)C(F)(F)F