Reaction Details
TargetCarbonic anhydrase 2
LigandBDBM26188
Substrate/Competitorn/a
Meas. Tech.ChEMBL_1508534 (CHEMBL3602570)
Ki 9900±n/a nM
Citation Güney, MÇavdar, HSentürk, MEkinci, D Synthesis and carbonic anhydrase inhibitory properties of novel uracil derivatives. Bioorg Med Chem Lett25:3261-3 (2015) 
 
Carbonic anhydrase 2
Name:Carbonic anhydrase 2
Type:Enzyme
Mol. Mass.:29250.71
Organism:Homo sapiens (Human)
Description:P00918
Residue:260
BDBM26188
NameBDBM26188
Synonyms:α-CA inhibitor, 12 1,2-dihydroxybenzene benzene-1,2-diol | phenol derivative, 2
TypeSmall organic molecule
Emp. Form.C6H6O2
Mol. Mass.110.1106
SMILESOc1ccccc1O