Reaction Details
TargetCarbonic anhydrase 1
LigandBDBM50106413
Substrate/Competitorn/a
Meas. Tech.ChEMBL_1508536 (CHEMBL3602572)
Ki 2108±n/a nM
Citation Meleddu, RMaccioni, EDistinto, SBianco, GMelis, CAlcaro, SCottiglia, FCeruso, MSupuran, CT New 4-[(3-cyclohexyl-4-aryl-2,3-dihydro-1,3-thiazol-2-ylidene)amino]benzene-1-sulfonamides, synthesis and inhibitory activity toward carbonic anhydrase I, II, IX, XII. Bioorg Med Chem Lett25:3281-4 (2015) 
 
Carbonic anhydrase 1
Name:Carbonic anhydrase 1
Type:Enzyme
Mol. Mass.:28873.37
Organism:Homo sapiens (Human)
Description:P00915
Residue:261
BDBM50106413
NameBDBM50106413
Synonyms:CHEMBL3601883
TypeSmall organic molecule
Emp. Form.C21H22FN3O2S2
Mol. Mass.431.547
SMILESNS(=O)(=O)c1ccc(cc1)\N=c1/scc(-c2ccc(F)cc2)n1C1CCCCC1