Reaction Details
TargetCarbonic anhydrase 2
LigandBDBM50106424
Substrate/Competitorn/a
Meas. Tech.ChEMBL_1508537 (CHEMBL3602573)
Ki 14±n/a nM
Citation Meleddu, RMaccioni, EDistinto, SBianco, GMelis, CAlcaro, SCottiglia, FCeruso, MSupuran, CT New 4-[(3-cyclohexyl-4-aryl-2,3-dihydro-1,3-thiazol-2-ylidene)amino]benzene-1-sulfonamides, synthesis and inhibitory activity toward carbonic anhydrase I, II, IX, XII. Bioorg Med Chem Lett25:3281-4 (2015) 
 
Carbonic anhydrase 2
Name:Carbonic anhydrase 2
Type:Enzyme
Mol. Mass.:29250.71
Organism:Homo sapiens (Human)
Description:P00918
Residue:260
BDBM50106424
NameBDBM50106424
Synonyms:CHEMBL3601890
TypeSmall organic molecule
Emp. Form.C22H25N3O2S2
Mol. Mass.427.583
SMILESCc1ccc(cc1)-c1cs\c(=N/c2ccc(cc2)S(N)(=O)=O)n1C1CCCCC1