Reaction Details
TargetCarbonic anhydrase 9
LigandBDBM50106418
Substrate/Competitorn/a
Meas. Tech.ChEMBL_1508538 (CHEMBL3602574)
Ki 33±n/a nM
Citation Meleddu, RMaccioni, EDistinto, SBianco, GMelis, CAlcaro, SCottiglia, FCeruso, MSupuran, CT New 4-[(3-cyclohexyl-4-aryl-2,3-dihydro-1,3-thiazol-2-ylidene)amino]benzene-1-sulfonamides, synthesis and inhibitory activity toward carbonic anhydrase I, II, IX, XII. Bioorg Med Chem Lett25:3281-4 (2015) 
 
Carbonic anhydrase 9
Name:Carbonic anhydrase 9
Type:Enzyme
Mol. Mass.:49669.03
Organism:Homo sapiens (Human)
Description:Catalytic domain of human cloned isozyme was used in the assay
Residue:459
BDBM50106418
NameBDBM50106418
Synonyms:CHEMBL3601889
TypeSmall organic molecule
Emp. Form.C27H27N3O2S2
Mol. Mass.489.652
SMILESNS(=O)(=O)c1ccc(cc1)\N=c1/scc(-c2ccc(cc2)-c2ccccc2)n1C1CCCCC1