Reaction Details
TargetCarbonic anhydrase 9
LigandBDBM50106423
Substrate/Competitorn/a
Meas. Tech.ChEMBL_1508538 (CHEMBL3602574)
Ki 17±n/a nM
Citation Meleddu, RMaccioni, EDistinto, SBianco, GMelis, CAlcaro, SCottiglia, FCeruso, MSupuran, CT New 4-[(3-cyclohexyl-4-aryl-2,3-dihydro-1,3-thiazol-2-ylidene)amino]benzene-1-sulfonamides, synthesis and inhibitory activity toward carbonic anhydrase I, II, IX, XII. Bioorg Med Chem Lett25:3281-4 (2015) 
 
Carbonic anhydrase 9
Name:Carbonic anhydrase 9
Type:Enzyme
Mol. Mass.:49669.03
Organism:Homo sapiens (Human)
Description:Catalytic domain of human cloned isozyme was used in the assay
Residue:459
BDBM50106423
NameBDBM50106423
Synonyms:CHEMBL3601891
TypeSmall organic molecule
Emp. Form.C22H25N3O3S2
Mol. Mass.443.582
SMILESCOc1ccc(cc1)-c1cs\c(=N/c2ccc(cc2)S(N)(=O)=O)n1C1CCCCC1