Reaction Details
TargetCarbonic anhydrase 12
LigandBDBM50106421
Substrate/Competitorn/a
Meas. Tech.ChEMBL_1508539 (CHEMBL3602575)
Ki 6.3±n/a nM
Citation Meleddu, RMaccioni, EDistinto, SBianco, GMelis, CAlcaro, SCottiglia, FCeruso, MSupuran, CT New 4-[(3-cyclohexyl-4-aryl-2,3-dihydro-1,3-thiazol-2-ylidene)amino]benzene-1-sulfonamides, synthesis and inhibitory activity toward carbonic anhydrase I, II, IX, XII. Bioorg Med Chem Lett25:3281-4 (2015) 
 
Carbonic anhydrase 12
Name:Carbonic anhydrase 12
Type:Enzyme
Mol. Mass.:39456.00
Organism:Homo sapiens (Human)
Description:Catalytic domain of human cloned isozyme was used in the assay
Residue:354
BDBM50106421
NameBDBM50106421
Synonyms:CHEMBL3601893
TypeSmall organic molecule
Emp. Form.C21H23N3O2S2
Mol. Mass.413.556
SMILESNS(=O)(=O)c1ccc(cc1)\N=c1/scc(-c2ccccc2)n1C1CCCCC1