Reaction Details
TargetMelanin-concentrating hormone receptor 1
LigandBDBM50106579
Substrate/Competitorn/a
Meas. Tech.ChEMBL_1508608 (CHEMBL3602719)
IC50 3.0±n/a nM
Citation Roth, GJHeckel, AKley, JTLehmann, TMüller, SGOost, TRudolf, KArndt, KBudzinski, RLenter, MLotz, RRSchindler, MThomas, LStenkamp, D Design, synthesis and evaluation of MCH receptor 1 antagonists--Part II: Optimization of pyridazines toward reduced phospholipidosis and hERG inhibition. Bioorg Med Chem Lett25:3270-4 (2015) 
 
Melanin-concentrating hormone receptor 1
Name:Melanin-concentrating hormone receptor 1
Type:G Protein-Coupled Receptor (GPCR)
Mol. Mass.:45976.27
Organism:Homo sapiens (Human)
Description:Membranes from CHO-K1 cells stably expressing human MCH1R were used in assays.
Residue:422
BDBM50106579
NameBDBM50106579
Synonyms:CHEMBL3601036
TypeSmall organic molecule
Emp. Form.C26H32N4O2
Mol. Mass.432.5579
SMILESOC1CCN(Cc2ccc(NCCCc3ccc(OCc4ccccc4)nn3)cc2)CC1