Reaction Details
TargetUrease
LigandBDBM50099857
Substrate/Competitorn/a
Meas. Tech.ChEMBL_1508665 (CHEMBL3602820)
IC50 42000±n/a nM
Citation Taha, MIsmail, NHKhan, AShah, SAAnwar, AHalim, SAFatmi, MQImran, SRahim, FKhan, KM Synthesis of novel derivatives of oxindole, their urease inhibition and molecular docking studies. Bioorg Med Chem Lett25:3285-9 (2015) 
 
Urease
Name:Urease
Type:Enzyme
Mol. Mass.:90746.20
Organism:Canavalia ensiformis (Jack bean) (Horse bean)
Description:P07374
Residue:840
BDBM50099857
NameBDBM50099857
Synonyms:ACETOHYDROXAMIC ACID (AHA) Acethydroxamsaeure Acetic acid, oxime Cetohyroxamic acid Methylhydroxamic acid N-Acetylhydroxylamine acetohydroxamic acid
TypeSmall organic molecule
Emp. Form.C2H5NO2
Mol. Mass.75.0666
SMILESCC(=O)NO