Reaction Details
TargetAurora kinase A
LigandBDBM50106629
Substrate/Competitorn/a
Meas. Tech.ChEMBL_1508718 (CHEMBL3602981)
Kd 9.1±n/a nM
Citation Lavogina, DKisand, KRaidaru, GUri, A Fluorescent photoaffinity probes for mitotic protein kinase Aurora A. Bioorg Med Chem Lett25:3290-4 (2015) 
 
Aurora kinase A
Name:Aurora kinase A
Type:Serine/threonine-protein kinase
Mol. Mass.:45830.98
Organism:Homo sapiens (Human)
Description:O14965
Residue:403
BDBM50106629
NameBDBM50106629
Synonyms:CHEMBL3600762
TypeSmall organic molecule
Emp. Form.C130H174ClFN35O21S3
Mol. Mass.2713.64
SMILESCCN1\C(=C\C=C\C2=[N+](CC)c3ccc(cc3C2(C)C)S(O)(=O)=O)C(C)(CCCC(=O)NCCCC[C@@H](NC(=O)[C@@H](CCCNC(N)=N)NC(=O)[C@@H](CCCNC(N)=N)NC(=O)[C@@H](CCCNC(N)=N)NC(=O)[C@@H](CCCNC(N)=N)NC(=O)[C@@H](CCCNC(N)=N)NC(=O)[C@@H](CCCNC(N)=N)NC(=O)[C@H](Cc2ccc(cc2)C(=O)c2ccccc2)NC(=O)[C@H](Cc2ccc(cc2)C(=O)c2ccccc2)NC(=O)CCCNC(=O)[C@@]2(Cc3cccc(Nc4nccs4)n3)CC[C@@H](CC2)Oc2cccc(Cl)c2F)C(N)=O)c2cc(ccc12)S(O)(=O)=O