Reaction Details
TargetAurora kinase A
LigandBDBM50106630
Substrate/Competitorn/a
Meas. Tech.ChEMBL_1508718 (CHEMBL3602981)
Kd 2.2±n/a nM
Citation Lavogina, DKisand, KRaidaru, GUri, A Fluorescent photoaffinity probes for mitotic protein kinase Aurora A. Bioorg Med Chem Lett25:3290-4 (2015) 
 
Aurora kinase A
Name:Aurora kinase A
Type:Serine/threonine-protein kinase
Mol. Mass.:45830.98
Organism:Homo sapiens (Human)
Description:O14965
Residue:403
BDBM50106630
NameBDBM50106630
Synonyms:CHEMBL3600760
TypeSmall organic molecule
Emp. Form.C69H77ClFN12O11S
Mol. Mass.1336.939
SMILESCN(C)c1ccc2c(-c3ccc(cc3C(O)=O)C(=O)NCCCOCCOCCOCCCNC(=O)[C@@H](Cc3ccc(cc3)N=[N+]=[N-])NC(=O)CCNC(=O)[C@@]3(Cc4cccc(Nc5nccs5)n4)CC[C@@H](CC3)Oc3cccc(Cl)c3F)c3ccc(cc3oc2c1)=[N+](C)C