Reaction Details
TargetAurora kinase A
LigandBDBM50106631
Substrate/Competitorn/a
Meas. Tech.ChEMBL_1508718 (CHEMBL3602981)
Kd 1.9±n/a nM
Citation Lavogina, DKisand, KRaidaru, GUri, A Fluorescent photoaffinity probes for mitotic protein kinase Aurora A. Bioorg Med Chem Lett25:3290-4 (2015) 
 
Aurora kinase A
Name:Aurora kinase A
Type:Serine/threonine-protein kinase
Mol. Mass.:45830.98
Organism:Homo sapiens (Human)
Description:O14965
Residue:403
BDBM50106631
NameBDBM50106631
Synonyms:CHEMBL3600653
TypeSmall organic molecule
Emp. Form.C75H78ClFN17O10S
Mol. Mass.1464.046
SMILESCN(C)c1ccc2c(-c3ccc(cc3C(O)=O)C(=O)NCCCC[C@H](NC(=O)[C@H](Cc3ccc(cc3)N=[N+]=[N-])NC(=O)[C@H](Cc3ccc(cc3)N=[N+]=[N-])NC(=O)CCCNC(=O)[C@@]3(Cc4cccc(Nc5nccs5)n4)CC[C@@H](CC3)Oc3cccc(Cl)c3F)C(N)=O)c3ccc(cc3oc2c1)=[N+](C)C