Reaction Details
TargetPhosphatidylinositol 4-phosphate 5-kinase type-1 gamma
LigandBDBM50107264
Substrate/Competitorn/a
Meas. Tech.ChEMBL_1508846 (CHEMBL3603395)
IC50 31623±n/a nM
Citation Raubo, PAndrews, DMMcKelvie, JCRobb, GRSmith, JMSwarbrick, MEWaring, MJ Discovery of potent, selective small molecule inhibitors ofa-subtype of type III phosphatidylinositol-4-kinase (PI4KIIIa). Bioorg Med Chem Lett25:3189-93 (2015) 
 
Phosphatidylinositol 4-phosphate 5-kinase type-1 gamma
Name:Phosphatidylinositol 4-phosphate 5-kinase type-1 gamma
Type:PROTEIN
Mol. Mass.:73241.99
Organism:Homo sapiens (Human)
Description:ChEMBL_1508846
Residue:668
BDBM50107264
NameBDBM50107264
Synonyms:CHEMBL3600688
TypeSmall organic molecule
Emp. Form.C14H14N4S
Mol. Mass.270.353
SMILESCCNc1ccc(cn1)-c1ccc2nc(N)sc2c1