Reaction Details
TargetPhosphatidylinositol 4-phosphate 5-kinase type-1 gamma
LigandBDBM50107256
Substrate/Competitorn/a
Meas. Tech.ChEMBL_1508846 (CHEMBL3603395)
IC50<100000±n/a nM
Citation Raubo, PAndrews, DMMcKelvie, JCRobb, GRSmith, JMSwarbrick, MEWaring, MJ Discovery of potent, selective small molecule inhibitors ofa-subtype of type III phosphatidylinositol-4-kinase (PI4KIIIa). Bioorg Med Chem Lett25:3189-93 (2015) 
 
Phosphatidylinositol 4-phosphate 5-kinase type-1 gamma
Name:Phosphatidylinositol 4-phosphate 5-kinase type-1 gamma
Type:PROTEIN
Mol. Mass.:73241.99
Organism:Homo sapiens (Human)
Description:ChEMBL_1508846
Residue:668
BDBM50107256
NameBDBM50107256
Synonyms:CHEMBL3600784
TypeSmall organic molecule
Emp. Form.C22H25N3O3S2
Mol. Mass.443.582
SMILESO=c1cc(ccn1CC1CC1)-c1ccc2nc(NCC3CCS(=O)(=O)CC3)sc2c1