Reaction Details
TargetPhosphatidylinositol 4,5-bisphosphate 3-kinase catalytic subunit alpha isoform
LigandBDBM50107269
Substrate/Competitorn/a
Meas. Tech.ChEMBL_1508842 (CHEMBL3603391)
IC50 1259±n/a nM
Citation Raubo, PAndrews, DMMcKelvie, JCRobb, GRSmith, JMSwarbrick, MEWaring, MJ Discovery of potent, selective small molecule inhibitors ofa-subtype of type III phosphatidylinositol-4-kinase (PI4KIIIa). Bioorg Med Chem Lett25:3189-93 (2015) 
 
Phosphatidylinositol 4,5-bisphosphate 3-kinase catalytic subunit alpha isoform
Name:Phosphatidylinositol 4,5-bisphosphate 3-kinase catalytic subunit alpha isoform
Type:Enzyme Subunit
Mol. Mass.:124294.87
Organism:Homo sapiens (Human)
Description:P42336
Residue:1068
BDBM50107269
NameBDBM50107269
Synonyms:CHEMBL3600694
TypeSmall organic molecule
Emp. Form.C14H13N3O2S
Mol. Mass.287.337
SMILESNc1nc2ccc(cc2s1)-c1ccc(OCCO)nc1