Reaction Details
TargetPhosphatidylinositol 4-kinase alpha
LigandBDBM50107242
Substrate/Competitorn/a
Meas. Tech.ChEMBL_1508840 (CHEMBL3603389)
IC50 316±n/a nM
Citation Raubo, PAndrews, DMMcKelvie, JCRobb, GRSmith, JMSwarbrick, MEWaring, MJ Discovery of potent, selective small molecule inhibitors ofa-subtype of type III phosphatidylinositol-4-kinase (PI4KIIIa). Bioorg Med Chem Lett25:3189-93 (2015) 
 
Phosphatidylinositol 4-kinase alpha
Name:Phosphatidylinositol 4-kinase alpha
Type:Protein
Mol. Mass.:231326.70
Organism:Homo sapiens (Human)
Description:P42356
Residue:2102
BDBM50107242
NameBDBM50107242
Synonyms:CHEMBL3600778
TypeSmall organic molecule
Emp. Form.C14H13N3OS
Mol. Mass.271.338
SMILESCCn1ccc(cc1=O)-c1ccc2nc(N)sc2c1