Reaction Details
TargetPhosphatidylinositol 4-kinase alpha
LigandBDBM50107241
Substrate/Competitorn/a
Meas. Tech.ChEMBL_1508840 (CHEMBL3603389)
IC50 501±n/a nM
Citation Raubo, PAndrews, DMMcKelvie, JCRobb, GRSmith, JMSwarbrick, MEWaring, MJ Discovery of potent, selective small molecule inhibitors ofa-subtype of type III phosphatidylinositol-4-kinase (PI4KIIIa). Bioorg Med Chem Lett25:3189-93 (2015) 
 
Phosphatidylinositol 4-kinase alpha
Name:Phosphatidylinositol 4-kinase alpha
Type:Protein
Mol. Mass.:231326.70
Organism:Homo sapiens (Human)
Description:P42356
Residue:2102
BDBM50107241
NameBDBM50107241
Synonyms:CHEMBL3600777
TypeSmall organic molecule
Emp. Form.C13H11N3OS
Mol. Mass.257.311
SMILESCn1ccc(cc1=O)-c1ccc2nc(N)sc2c1