Reaction Details
TargetPhosphatidylinositol 4-kinase alpha
LigandBDBM50107273
Substrate/Competitorn/a
Meas. Tech.ChEMBL_1508840 (CHEMBL3603389)
IC50 398±n/a nM
Citation Raubo, PAndrews, DMMcKelvie, JCRobb, GRSmith, JMSwarbrick, MEWaring, MJ Discovery of potent, selective small molecule inhibitors ofa-subtype of type III phosphatidylinositol-4-kinase (PI4KIIIa). Bioorg Med Chem Lett25:3189-93 (2015) 
 
Phosphatidylinositol 4-kinase alpha
Name:Phosphatidylinositol 4-kinase alpha
Type:Protein
Mol. Mass.:231326.70
Organism:Homo sapiens (Human)
Description:P42356
Residue:2102
BDBM50107273
NameBDBM50107273
Synonyms:CHEMBL3600699
TypeSmall organic molecule
Emp. Form.C13H11N3O2S2
Mol. Mass.305.375
SMILESCS(=O)(=O)c1cncc(c1)-c1ccc2nc(N)sc2c1