Reaction Details
TargetPhosphatidylinositol 4-kinase alpha
LigandBDBM50107265
Substrate/Competitorn/a
Meas. Tech.ChEMBL_1508840 (CHEMBL3603389)
IC50 631±n/a nM
Citation Raubo, PAndrews, DMMcKelvie, JCRobb, GRSmith, JMSwarbrick, MEWaring, MJ Discovery of potent, selective small molecule inhibitors ofa-subtype of type III phosphatidylinositol-4-kinase (PI4KIIIa). Bioorg Med Chem Lett25:3189-93 (2015) 
 
Phosphatidylinositol 4-kinase alpha
Name:Phosphatidylinositol 4-kinase alpha
Type:Protein
Mol. Mass.:231326.70
Organism:Homo sapiens (Human)
Description:P42356
Residue:2102
BDBM50107265
NameBDBM50107265
Synonyms:CHEMBL3600689
TypeSmall organic molecule
Emp. Form.C15H16N4S
Mol. Mass.284.379
SMILESCCN(C)c1ccc(cn1)-c1ccc2nc(N)sc2c1