Reaction Details
TargetPhosphatidylinositol 4-kinase alpha
LigandBDBM50107264
Substrate/Competitorn/a
Meas. Tech.ChEMBL_1508840 (CHEMBL3603389)
IC50 631±n/a nM
Citation Raubo, PAndrews, DMMcKelvie, JCRobb, GRSmith, JMSwarbrick, MEWaring, MJ Discovery of potent, selective small molecule inhibitors ofa-subtype of type III phosphatidylinositol-4-kinase (PI4KIIIa). Bioorg Med Chem Lett25:3189-93 (2015) 
 
Phosphatidylinositol 4-kinase alpha
Name:Phosphatidylinositol 4-kinase alpha
Type:Protein
Mol. Mass.:231326.70
Organism:Homo sapiens (Human)
Description:P42356
Residue:2102
BDBM50107264
NameBDBM50107264
Synonyms:CHEMBL3600688
TypeSmall organic molecule
Emp. Form.C14H14N4S
Mol. Mass.270.353
SMILESCCNc1ccc(cn1)-c1ccc2nc(N)sc2c1