Reaction Details
TargetXanthine dehydrogenase/oxidase
LigandBDBM7459
Substrate/Competitorn/a
Meas. Tech.ChEMBL_1508988 (CHEMBL3602368)
IC50 7800±n/a nM
Citation Masuda, TNojima, SMiura, YHonda, SMasuda, A An oxidative coupling product of luteolin with cysteine ester and its enhanced inhibitory activity for xanthine oxidase. Bioorg Med Chem Lett25:3117-9 (2015) 
 
Xanthine dehydrogenase/oxidase
Name:Xanthine dehydrogenase/oxidase
Type:Enzyme
Mol. Mass.:146441.21
Organism:Homo sapiens (Human)
Description:P47989
Residue:1333
BDBM7459
NameBDBM7459
Synonyms:2-(3,4-dihydroxyphenyl)-5,7-dihydroxy-4H-chromen-4-one CHEMBL151 Luteolin (4) cid_5280445 med.21724, Compound 3
TypeSmall organic molecule
Emp. Form.C15H10O6
Mol. Mass.286.2363
SMILESOc1cc(O)c2c(c1)oc(cc2=O)-c1ccc(O)c(O)c1