Reaction Details
TargetP2X purinoceptor
LigandBDBM50087267
Substrate/Competitorn/a
Meas. Tech.ChEMBL_1509070 (CHEMBL3602553)
IC50 130±n/a nM
Citation Caseley, EAMuench, SPBaldwin, SASimmons, KFishwick, CWJiang, LH Docking of competitive inhibitors to the P2X7 receptor family reveals key differences responsible for changes in response between rat and human. Bioorg Med Chem Lett25:3164-7 (2015) 
 
P2X purinoceptor
Name:P2X purinoceptor
Type:PROTEIN
Mol. Mass.:67359.21
Organism:Cavia porcellus
Description:ChEMBL_109852
Residue:594
BDBM50087267
NameBDBM50087267
Synonyms:(1-(N,O-bis(1,5-isoquinolinesulfonyl)-N-methyl-L-tyrosyl)-4phenylpiperazine) 1-(N,O-bis(1,5-isoquinolinesulfonyl)-N-methyl-L-tyrosyl)-4-phenylpiperazine Isoquinoline-5-sulfonic acid 4-[(S)-2-[(isoquinoline-5-sulfonyl)-methyl-amino]-3-oxo-3-(4-phenyl-piperazin-1-yl)-propyl]-phenyl ester [(1-[N,O-bis(5-isoquinolinesulphonyl)-N-methyl-Ltyrosyl]-4-phenylpiperazine)
TypeSmall organic molecule
Emp. Form.C38H35N5O6S2
Mol. Mass.721.844
SMILESCN([C@@H](Cc1ccc(OS(=O)(=O)c2cccc3cnccc23)cc1)C(=O)N1CCN(CC1)c1ccccc1)S(=O)(=O)c1cccc2cnccc12