Reaction Details
TargetCarbonic anhydrase 1
LigandBDBM50107342
Substrate/Competitorn/a
Meas. Tech.ChEMBL_1509203 (CHEMBL3602836)
Ki 320±n/a nM
Citation Khloya, PCeruso, MRam, SSupuran, CTSharma, PK Sulfonamide bearing pyrazolylpyrazolines as potent inhibitors of carbonic anhydrase isoforms I, II, IX and XII. Bioorg Med Chem Lett25:3208-12 (2015) 
 
Carbonic anhydrase 1
Name:Carbonic anhydrase 1
Type:Enzyme
Mol. Mass.:28873.37
Organism:Homo sapiens (Human)
Description:P00915
Residue:261
BDBM50107342
NameBDBM50107342
Synonyms:CHEMBL3601394
TypeSmall organic molecule
Emp. Form.C25H22Cl2N6O4S2
Mol. Mass.605.516
SMILESCc1nn(c(Cl)c1C1CC(=NN1c1ccc(cc1)S(N)(=O)=O)c1ccc(Cl)cc1)-c1ccc(cc1)S(N)(=O)=O