Reaction Details
TargetCarbonic anhydrase 9
LigandBDBM50107372
Substrate/Competitorn/a
Meas. Tech.ChEMBL_1509205 (CHEMBL3602838)
Ki 6.9±n/a nM
Citation Khloya, PCeruso, MRam, SSupuran, CTSharma, PK Sulfonamide bearing pyrazolylpyrazolines as potent inhibitors of carbonic anhydrase isoforms I, II, IX and XII. Bioorg Med Chem Lett25:3208-12 (2015) 
 
Carbonic anhydrase 9
Name:Carbonic anhydrase 9
Type:Enzyme
Mol. Mass.:49669.03
Organism:Homo sapiens (Human)
Description:Catalytic domain of human cloned isozyme was used in the assay
Residue:459
BDBM50107372
NameBDBM50107372
Synonyms:CHEMBL3601462
TypeSmall organic molecule
Emp. Form.C21H19ClFN5O3S
Mol. Mass.475.924
SMILESCC(=O)N1N=C(CC1c1c(C)nn(c1Cl)-c1ccc(cc1)S(N)(=O)=O)c1ccc(F)cc1