Reaction Details
TargetCarbonic anhydrase 9
LigandBDBM50107367
Substrate/Competitorn/a
Meas. Tech.ChEMBL_1509205 (CHEMBL3602838)
Ki 52±n/a nM
Citation Khloya, PCeruso, MRam, SSupuran, CTSharma, PK Sulfonamide bearing pyrazolylpyrazolines as potent inhibitors of carbonic anhydrase isoforms I, II, IX and XII. Bioorg Med Chem Lett25:3208-12 (2015) 
 
Carbonic anhydrase 9
Name:Carbonic anhydrase 9
Type:Enzyme
Mol. Mass.:49669.03
Organism:Homo sapiens (Human)
Description:Catalytic domain of human cloned isozyme was used in the assay
Residue:459
BDBM50107367
NameBDBM50107367
Synonyms:CHEMBL3601392
TypeSmall organic molecule
Emp. Form.C26H25ClN6O5S2
Mol. Mass.601.097
SMILESCOc1ccc(cc1)C1=NN(C(C1)c1c(C)nn(c1Cl)-c1ccc(cc1)S(N)(=O)=O)c1ccc(cc1)S(N)(=O)=O