Reaction Details
TargetCarbonic anhydrase 2
LigandBDBM50107363
Substrate/Competitorn/a
Meas. Tech.ChEMBL_1509204 (CHEMBL3602837)
Ki 1.4±n/a nM
Citation Khloya, PCeruso, MRam, SSupuran, CTSharma, PK Sulfonamide bearing pyrazolylpyrazolines as potent inhibitors of carbonic anhydrase isoforms I, II, IX and XII. Bioorg Med Chem Lett25:3208-12 (2015) 
 
Carbonic anhydrase 2
Name:Carbonic anhydrase 2
Type:Enzyme
Mol. Mass.:29250.71
Organism:Homo sapiens (Human)
Description:P00918
Residue:260
BDBM50107363
NameBDBM50107363
Synonyms:CHEMBL3601393
TypeSmall organic molecule
Emp. Form.C25H22ClFN6O4S2
Mol. Mass.589.061
SMILESCc1nn(c(Cl)c1C1CC(=NN1c1ccc(cc1)S(N)(=O)=O)c1ccc(F)cc1)-c1ccc(cc1)S(N)(=O)=O