Reaction Details
TargetCarbonic anhydrase 2
LigandBDBM50107368
Substrate/Competitorn/a
Meas. Tech.ChEMBL_1509204 (CHEMBL3602837)
Ki 0.600000±n/a nM
Citation Khloya, PCeruso, MRam, SSupuran, CTSharma, PK Sulfonamide bearing pyrazolylpyrazolines as potent inhibitors of carbonic anhydrase isoforms I, II, IX and XII. Bioorg Med Chem Lett25:3208-12 (2015) 
 
Carbonic anhydrase 2
Name:Carbonic anhydrase 2
Type:Enzyme
Mol. Mass.:29250.71
Organism:Homo sapiens (Human)
Description:P00918
Residue:260
BDBM50107368
NameBDBM50107368
Synonyms:CHEMBL3601391
TypeSmall organic molecule
Emp. Form.C26H25ClN6O4S2
Mol. Mass.585.098
SMILESCc1nn(c(Cl)c1C1CC(=NN1c1ccc(cc1)S(N)(=O)=O)c1ccc(C)cc1)-c1ccc(cc1)S(N)(=O)=O