Reaction Details
TargetCarbonic anhydrase 1
LigandBDBM50107375
Substrate/Competitorn/a
Meas. Tech.ChEMBL_1509203 (CHEMBL3602836)
Ki 20±n/a nM
Citation Khloya, PCeruso, MRam, SSupuran, CTSharma, PK Sulfonamide bearing pyrazolylpyrazolines as potent inhibitors of carbonic anhydrase isoforms I, II, IX and XII. Bioorg Med Chem Lett25:3208-12 (2015) 
 
Carbonic anhydrase 1
Name:Carbonic anhydrase 1
Type:Enzyme
Mol. Mass.:28873.37
Organism:Homo sapiens (Human)
Description:P00915
Residue:261
BDBM50107375
NameBDBM50107375
Synonyms:CHEMBL3601459
TypeSmall organic molecule
Emp. Form.C21H20ClN5O3S
Mol. Mass.457.933
SMILESCC(=O)N1N=C(CC1c1c(C)nn(c1Cl)-c1ccc(cc1)S(N)(=O)=O)c1ccccc1