Reaction Details
TargetHeat shock protein HSP 90-alpha
LigandBDBM20926
Substrate/Competitorn/a
Meas. Tech.ChEMBL_1509294 (CHEMBL3603022)
IC50 59±n/a nM
Citation Sun, JLin, CQin, XDong, XTu, ZTang, FChen, CZhang, J Synthesis and biological evaluation of 3,5-disubstituted-4-alkynylisoxozales as a novel class of HSP90 inhibitors. Bioorg Med Chem Lett25:3129-34 (2015) 
 
Heat shock protein HSP 90-alpha
Name:Heat shock protein HSP 90-alpha
Type:Molecular Chaperone
Mol. Mass.:84623.45
Organism:Homo sapiens (Human)
Description:P07900
Residue:732
BDBM20926
NameBDBM20926
Synonyms:5-[2,4-dihydroxy-5-(propan-2-yl)phenyl]-N-ethyl-4-[4-(morpholin-4-ylmethyl)phenyl]-1,2-oxazole-3-carboxamide VER-52296/NVP-AUY922
TypeSmall organic molecule
Emp. Form.C26H31N3O5
Mol. Mass.465.5414
SMILESCCNC(=O)c1noc(c1-c1ccc(CN2CCOCC2)cc1)-c1cc(C(C)C)c(O)cc1O