Reaction Details
TargetMelanin-concentrating hormone receptor 1
LigandBDBM50107751
Substrate/Competitorn/a
Meas. Tech.ChEMBL_1509301 (CHEMBL3603114)
IC50 4.0±n/a nM
Citation Müller, SGHeckel, AKley, JTLehmann, TLustenberger, POost, TRoth, GJRudolf, KArndt, KLenter, MLotz, RRMaier, GMMarkert, MSchindler, MStenkamp, D Design, synthesis and evaluation of MCH receptor 1 antagonists--Part I: Optimization of HTS hits towards an in vivo efficacious tool compound BI 414. Bioorg Med Chem Lett25:3264-9 (2015) 
 
Melanin-concentrating hormone receptor 1
Name:Melanin-concentrating hormone receptor 1
Type:G Protein-Coupled Receptor (GPCR)
Mol. Mass.:45976.27
Organism:Homo sapiens (Human)
Description:Membranes from CHO-K1 cells stably expressing human MCH1R were used in assays.
Residue:422
BDBM50107751
NameBDBM50107751
Synonyms:CHEMBL3601023
TypeSmall organic molecule
Emp. Form.C27H27ClN2O2
Mol. Mass.446.968
SMILESCc1cc(ccc1OCCN1CCC[C@H]1CO)C#Cc1ccc(cn1)-c1ccc(Cl)cc1