Reaction Details
TargetBeta-3 adrenergic receptor
LigandBDBM50108088
Substrate/Competitorn/a
Meas. Tech.ChEMBL_1509452 (CHEMBL3602061)
EC50 535±n/a nM
Citation Wada, YShirahashi, HIwanami, TOgawa, MNakano, SMorimoto, AKasahara, KTanaka, ETakada, YOhashi, SMori, MShuto, S Discovery of Novel Indazole Derivatives as Highly Potent and Selective Humanß3-Adrenergic Receptor Agonists with the Possibility of Having No Cardiovascular Side Effects. J Med Chem58:6048-57 (2015) 
 
Beta-3 adrenergic receptor
Name:Beta-3 adrenergic receptor
Type:PROTEIN
Mol. Mass.:43161.83
Organism:Rattus norvegicus
Description:ChEMBL_1509452
Residue:400
BDBM50108088
NameBDBM50108088
Synonyms:CHEMBL3601305
TypeSmall organic molecule
Emp. Form.C21H28N4O4S
Mol. Mass.432.536
SMILESCC(C)c1n[nH]c2cc(OCCNC[C@H](O)c3cccc(NS(C)(=O)=O)c3)ccc12