Reaction Details
TargetPotassium voltage-gated channel subfamily H member 2
LigandBDBM162023
Substrate/Competitorn/a
Meas. Tech.ChEMBL_1509543 (CHEMBL3602290)
IC50 1300±n/a nM
Citation Holzer, PMasuya, KFuret, PKallen, JValat-Stachyra, TFerretti, SBerghausen, JBouisset-Leonard, MBuschmann, NPissot-Soldermann, CRynn, CRuetz, SStutz, SChène, PJeay, SGessier, F Discovery of a Dihydroisoquinolinone Derivative (NVP-CGM097): A Highly Potent and Selective MDM2 Inhibitor Undergoing Phase 1 Clinical Trials in p53wt Tumors. J Med Chem58:6348-58 (2015) 
 
Potassium voltage-gated channel subfamily H member 2
Name:Potassium voltage-gated channel subfamily H member 2
Type:Multi-pass membrane protein
Mol. Mass.:126672.65
Organism:Homo sapiens (Human)
Description:Q12809
Residue:1159
BDBM162023
NameBDBM162023
Synonyms:US9051279, 73a | US9051279, 73b
TypeSmall organic molecule
Emp. Form.C36H46ClN3O3
Mol. Mass.604.222
SMILESCC[C@@H](C)Oc1cc2[C@@H](N(C(=O)Cc2cc1OC)c1ccc(cc1)N(C)C[C@H]1CC[C@@H](CC1)N(C)C)c1ccc(Cl)cc1