Reaction Details
TargetPhosphatidylinositol 4,5-bisphosphate 3-kinase catalytic subunit beta isoform
LigandBDBM92862
Substrate/Competitorn/a
Meas. Tech.ChEMBL_1508354 (CHEMBL3602202)
IC50 399±n/a nM
Citation Wang, XMMao, SCao, LXie, XXXin, MHLian, JFCao, YXZhang, SQ Modification of N-(6-(2-methoxy-3-(4-fluorophenylsulfonamido)pyridin-5-yl)-[1,2,4]triazolo[1,5-a]pyridin-2-yl)acetamide as PI3Ks inhibitor by replacement of the acetamide group with alkylurea. Bioorg Med Chem23:5662-71 (2015) 
 
Phosphatidylinositol 4,5-bisphosphate 3-kinase catalytic subunit beta isoform
Name:Phosphatidylinositol 4,5-bisphosphate 3-kinase catalytic subunit beta isoform
Type:Enzyme Subunit
Mol. Mass.:122769.00
Organism:Homo sapiens (Human)
Description:P42338
Residue:1070
BDBM92862
NameBDBM92862
Synonyms:US9284315, BEZ-235 | mTOR Inhibitor, BEZ235
TypeSmall molecule
Emp. Form.C30H23N5O
Mol. Mass.469.5365
SMILESCn1c2cnc3ccc(cc3c2n(-c2ccc(cc2)C(C)(C)C#N)c1=O)-c1cnc2ccccc2c1