Reaction Details
TargetSerine/threonine-protein kinase mTOR
LigandBDBM92862
Substrate/Competitorn/a
Meas. Tech.ChEMBL_1508409 (CHEMBL3602347)
IC50 89±n/a nM
Citation Wang, XMMao, SCao, LXie, XXXin, MHLian, JFCao, YXZhang, SQ Modification of N-(6-(2-methoxy-3-(4-fluorophenylsulfonamido)pyridin-5-yl)-[1,2,4]triazolo[1,5-a]pyridin-2-yl)acetamide as PI3Ks inhibitor by replacement of the acetamide group with alkylurea. Bioorg Med Chem23:5662-71 (2015) 
 
Serine/threonine-protein kinase mTOR
Name:Serine/threonine-protein kinase mTOR
Type:Rapamycin target protein
Mol. Mass.:288917.12
Organism:Homo sapiens (Human)
Description:P42345
Residue:2549
BDBM92862
NameBDBM92862
Synonyms:US9284315, BEZ-235 | mTOR Inhibitor, BEZ235
TypeSmall molecule
Emp. Form.C30H23N5O
Mol. Mass.469.5365
SMILESCn1c2cnc3ccc(cc3c2n(-c2ccc(cc2)C(C)(C)C#N)c1=O)-c1cnc2ccccc2c1