Reaction Details
TargetAdenosine receptor A1
LigandBDBM50108681
Substrate/Competitorn/a
Meas. Tech.ChEMBL_1506710 (CHEMBL3598726)
Ki 4289±n/a nM
Citation Deng, QLim, YHAnand, RYu, YKim, JHZhou, WZheng, JTempest, PLevorse, DZhang, XGreene, SMullins, DCulberson, CSherborne, BParker, EMStamford, AAli, A Use of molecular modeling aided design to dial out hERG liability in adenosine A(2A) receptor antagonists. Bioorg Med Chem Lett25:2958-62 (2015) 
 
Adenosine receptor A1
Name:Adenosine receptor A1
Type:G Protein-Coupled Receptor (GPCR)
Mol. Mass.:36520.92
Organism:Homo sapiens (Human)
Description:P30542
Residue:326
BDBM50108681
NameBDBM50108681
Synonyms:CHEMBL3596516
TypeSmall organic molecule
Emp. Form.C20H24N8OS
Mol. Mass.424.523
SMILESCOc1cccc2c3nc(CN4CCN(C[C@H]4C)c4cnc(C)s4)nn3c(N)nc12