Reaction Details
TargetAdenosine receptor A2a
LigandBDBM50108673
Substrate/Competitorn/a
Meas. Tech.ChEMBL_1506709 (CHEMBL3598725)
Ki 13±n/a nM
Citation Deng, QLim, YHAnand, RYu, YKim, JHZhou, WZheng, JTempest, PLevorse, DZhang, XGreene, SMullins, DCulberson, CSherborne, BParker, EMStamford, AAli, A Use of molecular modeling aided design to dial out hERG liability in adenosine A(2A) receptor antagonists. Bioorg Med Chem Lett25:2958-62 (2015) 
 
Adenosine receptor A2a
Name:Adenosine receptor A2a
Type:G Protein-Coupled Receptor (GPCR)
Mol. Mass.:44716.46
Organism:Homo sapiens (Human)
Description:P29274
Residue:412
BDBM50108673
NameBDBM50108673
Synonyms:CHEMBL3596505
TypeSmall organic molecule
Emp. Form.C21H23FN8O
Mol. Mass.422.4587
SMILESCOc1cccc2c3nc(CN4CCN(C[C@H]4C)c4ccc(F)cn4)nn3c(N)nc12