Reaction Details
TargetAdenosine receptor A2a
LigandBDBM50108651
Substrate/Competitorn/a
Meas. Tech.ChEMBL_1506709 (CHEMBL3598725)
Ki 40±n/a nM
Citation Deng, QLim, YHAnand, RYu, YKim, JHZhou, WZheng, JTempest, PLevorse, DZhang, XGreene, SMullins, DCulberson, CSherborne, BParker, EMStamford, AAli, A Use of molecular modeling aided design to dial out hERG liability in adenosine A(2A) receptor antagonists. Bioorg Med Chem Lett25:2958-62 (2015) 
 
Adenosine receptor A2a
Name:Adenosine receptor A2a
Type:G Protein-Coupled Receptor (GPCR)
Mol. Mass.:44716.46
Organism:Homo sapiens (Human)
Description:P29274
Residue:412
BDBM50108651
NameBDBM50108651
Synonyms:CHEMBL3596508
TypeSmall organic molecule
Emp. Form.C21H24N8O
Mol. Mass.404.4683
SMILESCOc1cccc2c3nc(CN4CCN(C[C@H]4C)c4cccnc4)nn3c(N)nc12