Reaction Details
TargetMu-type opioid receptor
LigandBDBM50108965
Substrate/Competitorn/a
Meas. Tech.ChEMBL_1507463 (CHEMBL3599488)
Ki 27±n/a nM
Citation Lefever, MLi, YAnglin, BMuthu, DGiuvelis, DLowery, JJKnapp, BIBidlack, JMBilsky, EJPolt, R Structural Requirements for CNS Active Opioid Glycopeptides. J Med Chem58:5728-41 (2015) 
 
Mu-type opioid receptor
Name:Mu-type opioid receptor
Type:G Protein-Coupled Receptor (GPCR)
Mol. Mass.:44789.51
Organism:Homo sapiens (Human)
Description:P35372
Residue:400
BDBM50108965
NameBDBM50108965
Synonyms:CHEMBL3597087
TypeSmall organic molecule
Emp. Form.C90H146N20O27
Mol. Mass.1940.24
SMILESCC(C)C[C@H](NC(=O)[C@H](CO[C@@H]1O[C@H](CO)[C@@H](O)[C@H](O)[C@H]1O)NC(=O)[C@H](CCCCN)NC(=O)[C@H](CC(C)C)NC(=O)[C@H](C)NC(=O)[C@H](CCCCN)NC(=O)[C@H](CCC(O)=O)NC(=O)C(C)(C)NC(=O)[C@H](CC(C)C)NC(=O)[C@H](CC(N)=O)NC(=O)[C@H]1CCCN1C(=O)[C@H](CC(C)C)NC(=O)[C@H](Cc1ccccc1)NC(=O)CNC(=O)[C@@H](NC(=O)[C@@H](N)Cc1ccc(O)cc1)[C@@H](C)O)C(N)=O