Reaction Details
TargetDelta-type opioid receptor
LigandBDBM50108959
Substrate/Competitorn/a
Meas. Tech.ChEMBL_1507462 (CHEMBL3599487)
Ki 1400±n/a nM
Citation Lefever, MLi, YAnglin, BMuthu, DGiuvelis, DLowery, JJKnapp, BIBidlack, JMBilsky, EJPolt, R Structural Requirements for CNS Active Opioid Glycopeptides. J Med Chem58:5728-41 (2015) 
 
Delta-type opioid receptor
Name:Delta-type opioid receptor
Type:G Protein-Coupled Receptor (GPCR)
Mol. Mass.:40382.98
Organism:Homo sapiens (Human)
Description:Competition binding assays were carried out using membrane preparations from transfected HN9.10 cells that constitutively expressed the delta opioid receptor.
Residue:372
BDBM50108959
NameBDBM50108959
Synonyms:CHEMBL3597071
TypeSmall organic molecule
Emp. Form.C82H133N19O25
Mol. Mass.1785.0457
SMILESCC(C)C[C@H](NC(=O)[C@H](CO[C@@H]1O[C@H](CO)[C@@H](O)[C@H](O)[C@H]1O)NC(=O)[C@H](CCCCN)NC(=O)[C@H](CC(C)C)NC(=O)[C@H](C)NC(=O)[C@H](CCCCN)NC(=O)[C@H](CCC(O)=O)NC(=O)C(C)(C)NC(=O)[C@H](CC(C)C)NC(=O)[C@H](CC(N)=O)NC(=O)CCNC(=O)[C@H](Cc1ccccc1)N(C)C(=O)CNC(=O)[C@@H](C)NC(=O)[C@@H](N)Cc1ccc(O)cc1)C(N)=O