Reaction Details
TargetKappa-type opioid receptor
LigandBDBM50108976
Substrate/Competitorn/a
Meas. Tech.ChEMBL_1507464 (CHEMBL3599489)
Ki 19±n/a nM
Citation Lefever, MLi, YAnglin, BMuthu, DGiuvelis, DLowery, JJKnapp, BIBidlack, JMBilsky, EJPolt, R Structural Requirements for CNS Active Opioid Glycopeptides. J Med Chem58:5728-41 (2015) 
 
Kappa-type opioid receptor
Name:Kappa-type opioid receptor
Type:G Protein-Coupled Receptor (GPCR)
Mol. Mass.:42648.76
Organism:Homo sapiens (Human)
Description:P41145
Residue:380
BDBM50108976
NameBDBM50108976
Synonyms:CHEMBL3597075
TypeSmall organic molecule
Emp. Form.C89H142N20O26
Mol. Mass.1908.1982
SMILESCC(C)C[C@H](NC(=O)[C@H](CO[C@@H]1O[C@H](CO)[C@@H](O)[C@H](O)[C@H]1O)NC(=O)[C@H](CCCCN)NC(=O)[C@H](CC(C)C)NC(=O)[C@H](C)NC(=O)[C@H](CCCCN)NC(=O)[C@H](CCC(O)=O)NC(=O)C(C)(C)NC(=O)[C@H](CC(C)C)NC(=O)[C@H](CC(N)=O)NC(=O)[C@@H]1CCCN1C(=O)[C@@H]1CCCN1C(=O)[C@H](Cc1ccccc1)N(C)C(=O)CNC(=O)[C@@H](C)NC(=O)[C@@H](N)Cc1ccc(O)cc1)C(N)=O