Reaction Details
TargetVesicular acetylcholine transporter
LigandBDBM50108978
Substrate/Competitorn/a
Meas. Tech.ChEMBL_1507628 (CHEMBL3600039)
Ki 1.7±n/a nM
Citation Tu, ZZhang, XJin, HYue, XPadakanti, PKYu, LLiu, HFlores, HPKaneshige, KParsons, SMPerlmutter, JS Synthesis and biological characterization of a promising F-18 PET tracer for vesicular acetylcholine transporter. Bioorg Med Chem23:4699-709 (2015) 
 
Vesicular acetylcholine transporter
Name:Vesicular acetylcholine transporter
Type:PROTEIN
Mol. Mass.:56900.67
Organism:Homo sapiens (Human)
Description:ChEMBL_1507628
Residue:532
BDBM50108978
NameBDBM50108978
Synonyms:CHEMBL3597315
TypeSmall organic molecule
Emp. Form.C24H28FNO3
Mol. Mass.397.4824
SMILESO[C@@H]1Cc2ccccc2C[C@H]1N1CCC(CC1)C(=O)c1ccc(OCCF)cc1