Reaction Details
TargetCarbonic anhydrase 1
LigandBDBM50109149
Substrate/Competitorn/a
Meas. Tech.ChEMBL_1508923 (CHEMBL3602142)
Ki 5296±n/a nM
Citation Congiu, COnnis, VDeplano, ABalboni, GCeruso, MSupuran, CT Synthesis and carbonic anhydrase I, II, IX and XII inhibitory activity of sulfamates incorporating piperazinyl-ureido moieties. Bioorg Med Chem23:5619-25 (2015) 
 
Carbonic anhydrase 1
Name:Carbonic anhydrase 1
Type:Enzyme
Mol. Mass.:28873.37
Organism:Homo sapiens (Human)
Description:P00915
Residue:261
BDBM50109149
NameBDBM50109149
Synonyms:CHEMBL3601545
TypeSmall organic molecule
Emp. Form.C18H21N3O2
Mol. Mass.311.3782
SMILESCc1cccc(c1)N1CCN(CC1)C(=O)Nc1ccc(O)cc1