Reaction Details
TargetCarbonic anhydrase 1
LigandBDBM50109153
Substrate/Competitorn/a
Meas. Tech.ChEMBL_1508923 (CHEMBL3602142)
Ki>10000±n/a nM
Citation Congiu, COnnis, VDeplano, ABalboni, GCeruso, MSupuran, CT Synthesis and carbonic anhydrase I, II, IX and XII inhibitory activity of sulfamates incorporating piperazinyl-ureido moieties. Bioorg Med Chem23:5619-25 (2015) 
 
Carbonic anhydrase 1
Name:Carbonic anhydrase 1
Type:Enzyme
Mol. Mass.:28873.37
Organism:Homo sapiens (Human)
Description:P00915
Residue:261
BDBM50109153
NameBDBM50109153
Synonyms:CHEMBL3601541
TypeSmall organic molecule
Emp. Form.C18H21N3O2
Mol. Mass.311.3782
SMILESOc1ccc(NC(=O)N2CCN(Cc3ccccc3)CC2)cc1