Reaction Details
TargetCarbonic anhydrase 1
LigandBDBM50109268
Substrate/Competitorn/a
Meas. Tech.ChEMBL_1508923 (CHEMBL3602142)
Ki 282±n/a nM
Citation Congiu, COnnis, VDeplano, ABalboni, GCeruso, MSupuran, CT Synthesis and carbonic anhydrase I, II, IX and XII inhibitory activity of sulfamates incorporating piperazinyl-ureido moieties. Bioorg Med Chem23:5619-25 (2015) 
 
Carbonic anhydrase 1
Name:Carbonic anhydrase 1
Type:Enzyme
Mol. Mass.:28873.37
Organism:Homo sapiens (Human)
Description:P00915
Residue:261
BDBM50109268
NameBDBM50109268
Synonyms:CHEMBL3601537
TypeSmall organic molecule
Emp. Form.C18H22N4O5S
Mol. Mass.406.456
SMILESCOc1ccc(cc1)N1CCN(CC1)C(=O)Nc1ccc(OS(N)(=O)=O)cc1