Reaction Details
TargetCarbonic anhydrase 1
LigandBDBM50109146
Substrate/Competitorn/a
Meas. Tech.ChEMBL_1508923 (CHEMBL3602142)
Ki 9.4±n/a nM
Citation Congiu, COnnis, VDeplano, ABalboni, GCeruso, MSupuran, CT Synthesis and carbonic anhydrase I, II, IX and XII inhibitory activity of sulfamates incorporating piperazinyl-ureido moieties. Bioorg Med Chem23:5619-25 (2015) 
 
Carbonic anhydrase 1
Name:Carbonic anhydrase 1
Type:Enzyme
Mol. Mass.:28873.37
Organism:Homo sapiens (Human)
Description:P00915
Residue:261
BDBM50109146
NameBDBM50109146
Synonyms:CHEMBL3601532
TypeSmall organic molecule
Emp. Form.C17H19FN4O4S
Mol. Mass.394.421
SMILESNS(=O)(=O)Oc1ccc(NC(=O)N2CCN(CC2)c2ccc(F)cc2)cc1