Reaction Details
TargetATP-dependent translocase ABCB1
LigandBDBM50109277
Substrate/Competitorn/a
Meas. Tech.ChEMBL_1508927 (CHEMBL3602146)
IC50 3.5±n/a nM
Citation Wang, ZWong, ILLi, FXYang, CLiu, ZJiang, TJiang, TFChow, LMWan, SB Optimization of permethyl ningalin B analogs as P-glycoprotein inhibitors. Bioorg Med Chem23:5566-73 (2015) 
 
ATP-dependent translocase ABCB1
Name:ATP-dependent translocase ABCB1
Type:Protein
Mol. Mass.:141503.50
Organism:Homo sapiens (Human)
Description:P08183
Residue:1280
BDBM50109277
NameBDBM50109277
Synonyms:CHEMBL3601686
TypeSmall organic molecule
Emp. Form.C40H39BrN2O10
Mol. Mass.787.649
SMILESCOc1ccc(cc1OC)C1=C(C(=O)N(C(=O)c2cc(Br)c(OCc3ccccc3)cc2OCCN2CCOCC2)C1=O)c1ccc(OC)c(OC)c1