Reaction Details
TargetPolymerase acidic protein
LigandBDBM50109350
Substrate/Competitorn/a
Meas. Tech.ChEMBL_1509125 (CHEMBL3602684)
IC50 8300±n/a nM
Citation Fudo, SYamamoto, NNukaga, MOdagiri, TTashiro, MNeya, SHoshino, T Structural and computational study on inhibitory compounds for endonuclease activity of influenza virus polymerase. Bioorg Med Chem23:5466-75 (2015) 
 
Polymerase acidic protein
Name:Polymerase acidic protein
Type:PROTEIN
Mol. Mass.:82573.84
Organism:Hepatitis C virus
Description:ChEMBL_64976
Residue:716
BDBM50109350
NameBDBM50109350
Synonyms:CHEMBL3600948
TypeSmall organic molecule
Emp. Form.C13H11ClN2O3
Mol. Mass.278.691
SMILESOc1ccc(\C=N\Nc2ccc(Cl)cc2)c(O)c1O