Reaction Details
TargetNuclear factor erythroid 2-related factor 2
LigandBDBM50109370
Substrate/Competitorn/a
Meas. Tech.ChEMBL_1509260 (CHEMBL3602923)
IC50 979±n/a nM
Citation Jiang, ZYXu, LLLu, MCChen, ZYYuan, ZWXu, XLGuo, XKZhang, XJSun, HPYou, QD Structure-Activity and Structure-Property Relationship and Exploratory in Vivo Evaluation of the Nanomolar Keap1-Nrf2 Protein-Protein Interaction Inhibitor. J Med Chem58:6410-21 (2015) 
 
Nuclear factor erythroid 2-related factor 2
Name:Nuclear factor erythroid 2-related factor 2
Type:PROTEIN
Mol. Mass.:67786.89
Organism:Homo sapiens (Human)
Description:ChEMBL_107924
Residue:605
BDBM50109370
NameBDBM50109370
Synonyms:CHEMBL3601214
TypeSmall organic molecule
Emp. Form.C32H34N2O8S2
Mol. Mass.638.751
SMILESCc1cc(C)c(c(C)c1)S(=O)(=O)N(CC(O)=O)c1ccc(N(CC(O)=O)S(=O)(=O)c2c(C)cc(C)cc2C)c2ccccc12